�{��_��{���_����,�{��_��{���_�Z��,�{��_��{���_�d�b�ԍ�,�{��_��{���_�x�Ɠ�,�{��_��{���_���p����,�{��_��{���_FAX�ԍ�,�{��_��{���_���̑�,��Q�җp���ԋ��_��Q�Ґ�p���ԋ��_�L��,��Q�җp���ԋ��_��Q�Ґ�p���ԋ��_�䐔,��Q�җp���ԋ��_��Q�Ґ�p���ԋ��_�ݔ��ڍׁi���R�L���j,��Q�җp���ԋ��_��Q�Ґ�p���ԋ��_�ݒu�ꏊ�Ɛݒu���i���R�L���j,��ʒ��ԋ��_��ʒ��ԋ��_�L��,��ʒ��ԋ��_��ʒ��ԋ��_���,��ʒ��ԋ��_��ʒ��ԋ��_�ݔ��ڍׁi���R�L���j,��ʒ��ԋ��_��ʒ��ԋ��_�ݒu�ꏊ�Ɛݒu���i���R�L���j,�o�����E�~�n���ʘH_�o�����̒i��_�L��,�o�����E�~�n���ʘH_�o�����̒i��_�ݔ��ڍׁi���R�L���j,�o�����E�~�n���ʘH_�o�����̒i��_�ݒu�ꏊ�Ɛݒu���i���R�L���j,�o�����E�~�n���ʘH_�o�����̃X���[�v_�L��,�o�����E�~�n���ʘH_�o�����̃X���[�v_�ݔ��ڍׁi���R�L���j,�o�����E�~�n���ʘH_�o�����̃X���[�v_�ݒu�ꏊ�Ɛݒu���i���R�L���j,�o�����E�~�n���ʘH_�����h�A_�L��,�o�����E�~�n���ʘH_�����h�A_�ݔ��ڍׁi���R�L���j,�o�����E�~�n���ʘH_�����h�A_�ݒu�ꏊ�Ɛݒu���i���R�L���j,�o�����E�~�n���ʘH_���o��Q�җU���p�u���b�N_�L��,�o�����E�~�n���ʘH_���o��Q�җU���p�u���b�N_�ݔ��ڍׁi���R�L���j,�o�����E�~�n���ʘH_���o��Q�җU���p�u���b�N_�ݒu�ꏊ�Ɛݒu���i���R�L���j,�o���A�t���[�g�C��_�o���A�t���[�g�C���̗L��_�L��,�o���A�t���[�g�C��_�o���A�t���[�g�C���̗L��_�ݔ��ڍׁi���R�L���j,�o���A�t���[�g�C��_�o���A�t���[�g�C���̗L��_�ݒu�ꏊ�Ɛݒu���i���R�L���j,�o���A�t���[�g�C��_���̊J����_���̊J����,�o���A�t���[�g�C��_���̊J����_�ݔ��ڍׁi���R�L���j,�o���A�t���[�g�C��_���̊J����_�ݒu�ꏊ�Ɛݒu���i���R�L���j,�o���A�t���[�g�C��_�����E�����ē�_�L��,�o���A�t���[�g�C��_�����E�����ē�_�ݔ��ڍׁi���R�L���j,�o���A�t���[�g�C��_�����E�����ē�_�ݒu�ꏊ�Ɛݒu���i���R�L���j,�o���A�t���[�g�C��_�肷��_�L��,�o���A�t���[�g�C��_�肷��_�ݒu�ʒu,�o���A�t���[�g�C��_�肷��_�ݔ��ڍׁi���R�L���j,�o���A�t���[�g�C��_�肷��_�ݒu�ꏊ�Ɛݒu���i���R�L���j,�o���A�t���[�g�C��_���c���p�x�b�h_�L��,�o���A�t���[�g�C��_���c���p�x�b�h_�ݔ��ڍׁi���R�L���j,�o���A�t���[�g�C��_�c���p�x�b�h_�ݒu�ꏊ�Ɛݒu���i���R�L���j,�o���A�t���[�g�C��_�I�X�g���C�g�Ή�_�Ή�,�o���A�t���[�g�C��_�I�X�g���C�g�Ή�_�ݔ��ڍׁi���R�L���j,�o���A�t���[�g�C��_�I�X�g���C�g�Ή�_�ݒu�ꏊ�Ɛݒu���i���R�L���j,�o���A�t���[�g�C��_���ނ�����_�L��,�o���A�t���[�g�C��_���ނ�����_�ݔ��ڍׁi���R�L���j,�o���A�t���[�g�C��_���ނ�����_�ݒu�ꏊ�Ɛݒu���i���R�L���j,�o���A�t���[�g�C��_�x�r�[�`�F�A_�L��,�o���A�t���[�g�C��_�x�r�[�`�F�A_�ݔ��ڍׁi���R�L���j,�o���A�t���[�g�C��_�x�r�[�`�F�A_�ݒu�ꏊ�Ɛݒu���i���R�L���j,�o���A�t���[�g�C��_��l�p�x�b�h_�L��,�o���A�t���[�g�C��_��l�p�x�b�h_�ݔ��ڍׁi���R�L���j,�o���A�t���[�g�C��_��l�p�x�b�h_�ݒu�ꏊ�Ɛݒu���i���R�L���j,�o���A�t���[�g�C��_�Ԉ֎q�Ή�_�Ή�,�o���A�t���[�g�C��_�Ԉ֎q�Ή�_�Ԉ֎q��]�X�y�[�X,�o���A�t���[�g�C��_�Ԉ֎q�Ή�_�Ԉ֎q��֍��ɉ��t���\�ȃX�y�[�X,�o���A�t���[�g�C��_�Ԉ֎q�Ή�_�ݔ��ڍׁi���R�L���j,�o���A�t���[�g�C��_�Ԉ֎q�Ή�_�ݒu�ꏊ�Ɛݒu���i���R�L���j,�o���A�t���[�g�C��_�w������_�L��,�o���A�t���[�g�C��_�w������_�ݔ��ڍׁi���R�L���j,�o���A�t���[�g�C��_�w������_�ݒu�ꏊ�Ɛݒu���i���R�L���j,�K�i_�X���[�v_�L��,�K�i_�X���[�v_�ݔ��ڍׁi���R�L���j,�K�i_�X���[�v_�ݒu�ꏊ�Ɛݒu���i���R�L���j,�K�i_�K�i���~�@_�L��,�K�i_�K�i���~�@_�ݔ��ڍׁi���R�L���j,�K�i_�K�i���~�@_�ݒu�ꏊ�Ɛݒu���i���R�L���j,�G�X�J���[�^�[_�G�X�J���[�^�[�̗L��_�L��,�G�X�J���[�^�[_�G�X�J���[�^�[�̗L��_�����ē�,�G�X�J���[�^�[_�G�X�J���[�^�[�̗L��_�ݔ��ڍׁi���R�L���j,�G�X�J���[�^�[_�G�X�J���[�^�[�̗L��_�ݒu�ꏊ�Ɛݒu���i���R�L���j,�G���x�[�^�[_�G���x�[�^�[�̗L��_�L��,�G���x�[�^�[_�G���x�[�^�[�̗L��_�ݔ��ڍׁi���R�L���j,�G���x�[�^�[_�G���x�[�^�[�̗L��_�ݒu�ꏊ�Ɛݒu���i���R�L���j,�G���x�[�^�[_�_���\�L_�L��,�G���x�[�^�[_�_���\�L_�ݔ��ڍׁi���R�L���j,�G���x�[�^�[_�_���\�L_�ݒu�ꏊ�Ɛݒu���i���R�L���j,�G���x�[�^�[_�X�g���b�`���[�Ή�_�Ή�,�G���x�[�^�[_�X�g���b�`���[�Ή�_�ݔ��ڍׁi���R�L���j,�G���x�[�^�[_�X�g���b�`���[�Ή�_�ݒu�ꏊ�Ɛݒu���i���R�L���j,�G���x�[�^�[_�Ԉ֎q�g�p�ґΉ�_�Ή�,�G���x�[�^�[_�Ԉ֎q�g�p�ґΉ�_2��ȏ����,�G���x�[�^�[_�Ԉ֎q�g�p�ґΉ�_�ݔ��ڍׁi���R�L���j,�G���x�[�^�[_�Ԉ֎q�g�p�ґΉ�_�ݒu�ꏊ�Ɛݒu���i���R�L���j,�G���x�[�^�[_�����E�����ē�_�L��,�G���x�[�^�[_�����E�����ē�_�ݔ��ڍׁi���R�L���j,�G���x�[�^�[_�����E�����ē�_�ݒu�ꏊ�Ɛݒu���i���R�L���j,�G���x�[�^�[_�肷��_�L��,�G���x�[�^�[_�肷��_�ݔ��ڍׁi���R�L���j,�G���x�[�^�[_�肷��_�ݒu�ꏊ�Ɛݒu���i���R�L���j,�G���x�[�^�[_��_�L��,�G���x�[�^�[_��_�ݔ��ڍׁi���R�L���j,�G���x�[�^�[_��_�ݒu�ꏊ�Ɛݒu���i���R�L���j,�q��Ċ֘A�X�y�[�X_���c���p�x�b�h_�L��,�q��Ċ֘A�X�y�[�X_���c���p�x�b�h_�ݔ��ڍׁi���R�L���j,�q��Ċ֘A�X�y�[�X_���c���p�x�b�h_�ݒu�ꏊ�Ɛݒu���i���R�L���j,�q��Ċ֘A�X�y�[�X_�����X�y�[�X_�L��,�q��Ċ֘A�X�y�[�X_�����X�y�[�X_�ݔ��ڍׁi���R�L���j,�q��Ċ֘A�X�y�[�X_�����X�y�[�X_�ݒu�ꏊ�Ɛݒu���i���R�L���j,�q��Ċ֘A�X�y�[�X_�x�r�[�J�[�ݏo_�L��,�q��Ċ֘A�X�y�[�X_�x�r�[�J�[�ݏo_�ݔ��ڍׁi���R�L���j,�q��Ċ֘A�X�y�[�X_�x�r�[�J�[�ݏo_�ݒu�ꏊ�Ɛݒu���i���R�L���j,�q��Ċ֘A�X�y�[�X_���ނ�����_�L��,�q��Ċ֘A�X�y�[�X_���ނ�����_�ݔ��ڍׁi���R�L���j,�q��Ċ֘A�X�y�[�X_���ނ�����_�ݒu�ꏊ�Ɛݒu���i���R�L���j,�ē��E����_�M�k�Ή�_�L��,�ē��E����_�M�k�Ή�_�ݔ��ڍׁi���R�L���j,�ē��E����_�M�k�Ή�_�ݒu�ꏊ�Ɛݒu���i���R�L���j,�ē��E����_�����E�������񋟐ݔ�_�L��,�ē��E����_�����E�������񋟐ݔ�_�ݔ��ڍׁi���R�L���j,�ē��E����_�����E�������񋟐ݔ�_�ݒu�ꏊ�Ɛݒu���i���R�L���j,�ē��E����_�R�~���j�P�[�V�����{�[�h_�L��,�ē��E����_�R�~���j�P�[�V�����{�[�h_�ݔ��ڍׁi���R�L���j,�ē��E����_�R�~���j�P�[�V�����{�[�h_�ݒu�ꏊ�Ɛݒu���i���R�L���j,�ē��E����_���}�[�N_�L��,�ē��E����_���}�[�N_�ݔ��ڍׁi���R�L���j,�ē��E����_���}�[�N_�ݒu�ꏊ�Ɛݒu���i���R�L���j,�ē��E����_�ē��E����_�L��,�ē��E����_�ē��E����_�ݔ��ڍׁi���R�L���j,�ē��E����_�ē��E����_�ݒu�ꏊ�Ɛݒu���i���R�L���j,���̑��ݔ�_�Ԉ֎q�ݏo_�L��,���̑��ݔ�_�Ԉ֎q�ݏo_�ݔ��ڍׁi���R�L���j,���̑��ݔ�_�Ԉ֎q�ݏo_�ݒu�ꏊ�Ɛݒu���i���R�L���j,���̑��ݔ�_�������̎��o��Q�җU���p�u���b�N_�L��,���̑��ݔ�_�������̎��o��Q�җU���p�u���b�N_�ݔ��ڍׁi���R�L���j,���̑��ݔ�_�������̎��o��Q�җU���p�u���b�N_�ݒu�ꏊ�Ɛݒu���i���R�L���j,���̑��ݔ�_�Ԉ֎q�Ή����ȁE�ݔ�_�L��,���̑��ݔ�_�Ԉ֎q�Ή����ȁE�ݔ�_�ݔ��ڍׁi���R�L���j,���̑��ݔ�_�Ԉ֎q�Ή����ȁE�ݔ�_�ݒu�ꏊ�Ɛݒu���i���R�L���j,���̑��ݔ�_�S�̃o���A�t���[�Ή�_�Ή�,���̑��ݔ�_�S�̃o���A�t���[�Ή�_�ݔ��ڍׁi���R�L���j,���̑��ݔ�_�S�̃o���A�t���[�Ή�_�ݒu�ꏊ�Ɛݒu���i���R�L���j,���̑����l_�i���R�L���j,X���W,Y���W
�i�q���w,�����s�䓌����7����,050-2016-1600,��,,,,��,,,,��,,,,��,,,,,,,,,�L,,,�L,,�y�n��3�K�z�V�����R���R�[�X�y1�K�z���D�O�A�g�������A�ݗ����R���R�[�X�y3�K�R���R�[�X�z1�E2�Ԑ��z�[���s���K�i�t�߁A�������D���ʍs���G�X�J���[�^�[�t��,����,,,,,,�L,����,,,��,,,�L,�����V�����[�Ή��i�ꕔ�̃g�C���̂݁j,,�L,,,�L,,,,,,�L,,,,,�L,,�ꕔ�̃g�C���̂�,�L,,�e���ɒi�������p�̃X���[�v����,,,,�L,,,,�L,,�y���D���̂݋L�ځz1�K�R���R�[�X�E13-17�Ԑ��z�[���`2�K11�E12�Ԑ��z�[���`3�K�R���R�[�X���J���D�t�߁A3�K�R���R�[�X�`1-10�Ԑ��e�z�[���A1�K�V�����R���R�[�X�`�n��3�K�V�����R���R�[�X�`19�E20�Ԑ��z�[���A�n��3�K�V�����R���R�[�X�`21�E22�Ԑ��z�[��,�L,,,,,,�L,,,�y���D���̂݋L�ځz1�K�R���R�[�X�E13-17�Ԑ��z�[���`2�K11�E12�Ԑ��z�[���`3�K�R���R�[�X���J���D�t�߁A3�K�R���R�[�X�`1-10�Ԑ��e�z�[���A1�K�V�����R���R�[�X�`�n��3�K�V�����R���R�[�X�`19�E20�Ԑ��z�[���A�n��3�K�V�����R���R�[�X�`21�E22�Ԑ��z�[��,,,,,,,,,,,,,�L,�򐅉�����A�V���N����B�J�[�e���ɂ��d�؂肠��,�x�r�[�x�e���i1�K�V�����̂肩�����t�߁A3�K�R���R�[�X1�E2�Ԑ��s���K�i�t�߁j,�L,�x�r�[�J�[�����^���T�[�r�X�u�x�r�J���v�i�L���j,�x�r�[�x�e���i1�K�V�����̂肩�����t�߁A3�K�R���R�[�X1�E2�Ԑ��s���K�i�t�߁j�ANewDays�G�L���[�g���i�������D�O�j,�L,���ނp���ݔ�����,�x�r�[�x�e���i1�K�V�����̂肩�����t�߁A3�K�R���R�[�X1�E2�Ԑ��s���K�i�t�߁j,�L,,,�L,,,,,,,,,�L,�_���^���\�A�K�i�肷�蓙����,,,,,�L,,�w�z�[���A�R���R�[�X��,�L,�X���[�Y�ɂ����p�����������߂Ɋ֌W�ӏ��Ƃ̒������K�v�ȏꍇ������܂��̂ŁA���O�̘A���ɂ����͂����肢�������܂��B�������E���������֗��ł��B�抷�w�E�~�ԉw�̏����������������B�����Ԃɂ͗]�T�������Ă����w���������܂��悤���肢�������܂��B,�n��o��������e�z�[���܂ŎԂ����ňړ��ł���o�H����,�L,�u�������E�T�|�[�g�v�^����ʔN���{,,�R����i2�E3�Ԑ��j�A���l���k���i1�E4�Ԑ��j�z�[���ɂ̓z�[���h�A�A�i���E���Ԃ̏�������~������,35.7137338,139.776945
�i�q��k���w,�����s�䓌����5����,050-2016-1600,��,,,,��,,,,��,,,,��,,,,,,,,,�L,,,�L,,�k�����D���R���R�[�X,����,,,,,,�L,����,,,��,,,�L,,,�L,,,�L,,,,,,�L,,,,,�L,,,,,,,,,�L,,,,�L,,�R���R�[�X�`�e�z�[��,�L,,,,,,�L,,,,,,,,,,�L,,,��,,,��,,,��,,,�L,,�g�C����,�L,,,�L,,,,,,,,,�L,�_���^���\�A�K�i�肷�蓙����,,,,,�L,,�w�z�[���A�R���R�[�X��,�L,"�X���[�Y�ɂ����p�����������߂Ɋ֌W�ӏ��Ƃ̒������K�v�ȏꍇ������܂��̂ŁA���O�̘A���ɂ����͂����肢�������܂��B�k���������p�������B�抷�w�E�~�ԉw�̏����������������B�����Ԃɂ͗]�T�������Ă����w���������܂��悤���肢�������܂��B",�n��o��������e�z�[���܂ŎԂ����ňړ��ł���o�H����,�L,�u�������E�T�|�[�g�v�^����ʔN���{,,�S�z�[���i1-4�Ԑ��j�Ƀz�[���h�A�A�i���E���Ԃ̏�������~������,35.70712674,139.7747165
�i�q��J�w,�����s�䓌�捪��1����,050-2016-1600,��,,,,��,,,,��,,,,��,,,,,,,,,�L,,,�L,,������D��,,,,,,,�L,����,,,��,,,�L,�ȈՌ^�i�w�������̌^�j,,�L,,,��,,,,,,�L,,,,,�L,,,�L,,������D����e�z�[���s���G���x�[�^�[�܂ł̒ʘH,,,,�L,,,�R���R�[�X����e�z�[���܂Łi����̂݁j,�L,,����R���R�[�X�`�e�z�[��,�L,,,,,,�L,,,,,,,�L,,,,,,��,,,��,,,��,,,��,,,�L,,�w���z�u�̂�����D�͓���̂�,�L,,,,,,,,,�L,�_���^���\�A�K�i�肷�蓙����,,,,,�L,,�w�z�[���A�R���R�[�X��,�L,"�X���[�Y�ɂ����p�����������߂Ɋ֌W�ӏ��Ƃ̒������K�v�ȏꍇ������܂��̂ŁA���O�̘A���ɂ����͂����肢�������܂��B�Ԉ֎q�������p�̕��͓���������p�������B�抷�w�E�~�ԉw�̏����������������B�����Ԃɂ͗]�T�������Ă����w���������܂��悤���肢�������܂��B",�������e�z�[���܂ŎԂ����ňړ��ł���o�H����,�L,�u�������E�T�|�[�g�v�^����ʔN���{,,�R����i2�E3�Ԑ��j�z�[���Ƀz�[���h�A����B3�Ԑ��͒i���E���Ԃ̏�������~������,35.72146958,139.7780384
�i�q�󑐋��w,�����s�䓌��󑐋�1����,050-2016-1600,��,,,,,,,,,,,,��,,,,,,,,,�L,,,�L,,�������D���@��2�K,,,,,,,,,,,,,,�L,,,��,,,,,,,,,�L,,,,,,,,,,,,,,��,,,,�L,,�������D�`��2�K�R���R�[�X�A��2�K�R���R�[�X�`�e�z�[��,,,,,,,�L,,,,,,,,,,,,,,,,,,,,,,,,,�L,,,�L,,,,,,,,,�L,�_���^���\����,,,,,�L,,�w�z�[���A�R���R�[�X��,�L,"����Ԃ̍ۂɉ��D���ɂČW���ɂ��`�����������B�抷�w�E�~�ԉw�̏����������������B�����Ԃɂ͗]�T�������Ă����w�������܂��悤���肢�v���܂��B",��������e�z�[���܂ŎԂ����ňړ��ł���o�H����,�L,�u�������E�T�|�[�g�v�^����ʔN���{,,�z�[���i1�E2�Ԑ��j�Ƀz�[���h�A����,35.6974247,139.7845023
�s�]�󑐉w,�����s�䓌�搼��3����1-11,03-3847-0922,��,4:53����0:45,,,��,,,,��,,,,��,,,�L,�X���[�v����,,�L,,,�L,,,�L,,,����,,,�L,,,�L,����,,,��,,,�L,,,��,,,��,,���@�\�g�C���ł͂Ȃ��A�j���g�C�����ȈՑ��@�\�g�C���Ƀx�r�[�`�F�A����,�L,,,�L,�L,�L,,,�L,�I�X�g���C�g�p�ȈՐ�����̌^,,��,,,��,,,�L,�L,,,�L,,,�L,,,�L,,,�L,�L,,,�L,,,�L,,,�L,,,��,,,��,,,��,,,�L,,�j���g�C����,�L,,����,�L,,,�L,,,��,,,�L,,,��,,,�L,,,�L,,,�L,,,,35.71401381,139.7924639
�s�]�V��k���w,�����s�䓌�揬��2����21-18,03-3839-2922,��,4:45����0:55,,,��,,,,��,,,,��,,A3�AA4�o�����ɃG���x�[�^�[����,�L,,A2�o����,�L,,,�L,,,�L,,,����,,,�L,�_���ē��ƂƂ��ɐݒu,,�L,����,,,��,,,�L,,,��,,���@�\�g�C���ł͂Ȃ��A�j���g�C���ɂ��ނ����䂠��,��,,���@�\�g�C���ł͂Ȃ��A�j���g�C�����ȈՑ��@�\�g�C���Ƀx�r�[�`�F�A����,�L,,,�L,�L,�L,,,�L,�I�X�g���C�g�p�ȈՐ�����̌^,,��,,,��,,,�L,�L,,,�L,,,�L,,,�L,,,�L,�L,,,�L,,,�L,,,�L,,,��,,,��,,,��,,,�L,,�j���g�C����,�L,,����,�L,,,�L,,,�L,,,�L,,,��,,,�L,,,�L,,,�L,,,,35.70703527,139.7819435
�������g����������w,�����s�䓌����7����1-1,03-3841-1662,��,�n������I�d,,,��,,,,��,,,,��,,�G���x�[�^�[����,��,,,��,,,�L,,,�L,,,����,,,�L,,,�L,����,,,�L,,,�L,,,�L,,,�L,,,�L,,,�L,,,,,�L,,,�L,,,�L,,,�L,,,,�L,,,�L,,,��,,,�L,,,,�L,,,�L,,,�L,,,��,,,��,,,��,,,��,,,�L,,,�L,,,��,,,��,,,�L,,,�L,,,��,,,�L,,,�L,,,,35.7116621,139.7759733
�������g������J�����w,�����s�䓌�擌���3����19-6,03-3832-6629,��,�n������I�d,,,��,,,,��,,,,��,,�G���x�[�^�[����,��,,,�L,,,�L,,,�L,,,����,,,�L,,,�L,����,,,�L,,,�L,,,�L,,,�L,,,��,,,�L,�L,�L,,,�L,,,��,,,��,,,�L,,,,�L,,,�L,,,��,,,�L,��,,,�L,,,�L,,,�L,,,��,,,��,,,��,,,��,,,�L,,,�L,,,��,,,��,,,�L,,,�L,,,��,,,�L,,,�L,,,,35.71152986,139.7772382
�������g����������L���H�w,�����s�䓌����3����29,03-3831-2512,��,�n������I�d,,,��,,,,��,,,,��,,�G���x�[�^�[����,��,,,��,,,�L,,,�L,,,�蓮,,,�L,,,�L,����,,,�L,,,�L,,,�L,,,�L,,,��,,,�L,,,,,�L,,,��,,,�L,,,�L,,,,�L,,,�L,,,�L,,,�L,,,,�L,,,�L,,,�L,,,��,,,��,,,��,,,��,,,�L,,,�L,,,��,,,��,,,�L,,,�L,,,��,,,�L,,,�L,,,,35.70777254,139.7729766
�������g������J������k���w,�����s�䓌����5����24-12,03-3832-6669,��,1�E2�ԏo�����̂ݎ��Ԑ�������i6:00����I�Ԃ܂Łj,,,��,,,,��,,,,��,,�G���x�[�^�[����,��,,,��,,,�L,,,�L,,,����,,,�L,,,�L,����,,,�L,,,�L,,,�L,,,�L,,,��,,,�L,�L,�L,,,�L,,,��,,,�L,,,�L,�L,,,�L,,,�L,,,�L,,,��,,,,�L,,,�L,,,�L,,,��,,,��,,,��,,,��,,,�L,,,�L,,,��,,,��,,,�L,,,�L,,,��,,,�L,,,�L,,,,35.70653604,139.7761877
�������g��������󑐉w,�����s�䓌���1����1-3,03-3841-2052,��,6�ԏo�����̂ݎ��Ԑ�������i5:10����24:14�j,,,��,,,,��,,,,��,,�G���x�[�^�[����,�L,,,�L,,,��,,,�L,,,����,,,�L,,,�L,����,,,�L,,,�L,,,�L,,,�L,,,��,,,�L,,,,,�L,,,��,,,�L,,,�L,,,,�L,,,�L,,,��,,,�L,,,,�L,,,�L,,,�L,,,��,,,��,,,��,,,��,,,�L,,,�L,,,��,,,��,,,�L,,,�L,,,��,,,�L,,,�L,,,,35.71053035,139.7976116
�������g��������c�����w,�����s�䓌�搼��1����1-18,03-3841-2679,��,3�ԏo�����̂ݎ��Ԑ�������i5:10����I�ԁj,,,��,,,,��,,,,��,,�G���x�[�^�[����,��,,,��,,,�L,,,�L,,,����,,,�L,,,�L,����,,,�L,,,�L,,,�L,,,�L,,,��,,,�L,,,,,�L,,,��,,,��,,,��,,,,�L,,,�L,,,�L,,,�L,,,,�L,,,�L,,,�L,,,��,,,��,,,��,,,�L,,,�L,,,�L,,,��,,,��,,,�L,,,�L,,,��,,,�L,,,�L,,,,35.70989559,139.7907089
�������g������J�����J�w,�����s�䓌�扺�J2����15-1,03-3872-0992,��,1�ԏo�����i�n������23:59�A24:09�j�A2�ԏo�����i6:00����I�ԁj���Ԑ�������,,,��,,,,��,,,,��,,�G���x�[�^�[����,��,,,��,,,�L,,,�L,,,����,,,�L,,,�L,����,,,�L,,,�L,,,�L,,,�L,,,��,,,�L,�L,�L,,,�L,,,��,,,��,,,�L,�L,,,�L,,,�L,,,��,,,�L,��,,,�L,,,�L,,,�L,,,��,,,��,,,��,,,��,,,�L,,,�L,,,��,,,��,,,�L,,,�L,,,��,,,�L,,,�L,,,,35.72070269,139.7845773
�������g������J���O�m�։w,�����s�䓌�捪��5����19-6,03-3872-0993,��,�n������I�d,,,��,,,,��,,,,��,,�G���x�[�^�[����,��,,,��,,,�L,,,�L,,,����,,,�L,,,�L,����,,,�L,,,�L,,,�L,,,�L,,,��,,,�L,�L,�L,,,�L,,,��,,,�L,,,��,,,,�L,,,�L,,,��,,,�L,,,,�L,,,�L,,,�L,,,��,,,��,,,��,,,��,,,�L,,,�L,,,��,,,��,,,�L,,,�L,,,��,,,�L,,,�L,,,,35.72957494,139.7913381
�������g���������ג��w,�����s�䓌�擌���3����33-11,03-3832-0646,��,�n������I�d,,,��,,,,��,,,,��,,�G���x�[�^�[����,��,,,��,,,�L,,,�L,,,����,,,�L,,,�L,����,,,�L,,,�L,,,�L,,,�L,,,��,,,�L,�L,�L,,,�L,,,��,,,��,,,��,,,,�L,,,�L,,,��,,,�L,,,,�L,,,�L,,,�L,,,��,,,��,,,��,,,��,,,�L,,,�L,,,��,,,��,,,�L,,,�L,,,��,,,�L,,,�L,,,,35.71141305,139.7825733
�s�c��]�ː�����k���w,�����s�䓌����5����26-6,03-3834-6485,��,�n������I�d,,,��,,,,��,,,,��,,A6�o�����ɃG���x�[�^�[����BA6�AA7�AA8�K�i�o�������͒i���Ȃ�,��,,,��,,,��,,�w�̏o��������ԗ��̏�~��,�L,,�n��1�K��������R���R�[�X��1����,����,,,��,,,�L,����,�Œ�L�^�肷��1�����A�����グ���肷��1����,,��,���ނ�����ɂđΉ�,,�L,�ȈՌ^�i�֊�ɐ�򐅐���ݒu�j,,�L,,,��,,,��,,,�L,�L,�L,���a150cm�̎Ԉ֎q��]�X�y�[�X����,,�L,�I�X�g���C�g�p�ȈՐ�����̌^,,��,,,��,,,�L,�L,,A5�o������1�@�AA6�o������2�@�A������i�󑐕��ʁj�ʘH��1�@�A������i�a�J���ʁj�ʘH��1�@�A����J���A���ʘH��2�@�i2�A�j�A�z�[���`�R���R�[�X��3�@,�L,11�l���,A6�o������1�@�A�z�[���`�R���R�[�X��1�@,�L,����A�G���x�[�^�[�����ɂ���,�v2�@,��,,,�L,��,�Ԉ֎q�g�p�҂��P�Ƃŏ�~�\,�v2�@,�L,�����K�A���~�����A�h�A�J�������ňē�,�v2�@,�L,�G���x�[�^�[��,�v2�@,�L,�����܂Ō�����,,��,,,�L,,,��,,,��,,,�L,,����,�L,��ԉ^�s���\�����u,���D���t��,�L,,����,�L,,AED�P�[�X�ɓ\�t,�L,,�K�i�肷��A�_���^���\�A���������@�A�����ē��t�G�m�ē���,��,,,�L,,�w�̏o��������ԗ��̏�~���܂�,�L,�z�[���Ǝԗ��̒i���΍�����{�A�ʘH���̍L�����D�@�A�����̒Ⴂ���������@�i������������s�@�A�������Z�@�����܂ށj�A�Ԉ֎q�p�X���[�v�A���O�d�b,�y�i���΍�z4����3�Ԕ���5����1�Ԕ��y�Ԉ֎q�p�X���[�v�z�����ɂđΉ�,�L,�w�W�����̃T�[�r�X��m���i�擾,,,35.7080318,139.7727679
�s�c�󑐐��󑐉w,�����s�䓌���`1����12-14,03-3844-4689,��,�n������I�d,,,��,,,,��,,,,��,,A2b�o�����ɃG���x�[�^�[����BA1�AA2a�AA2b�K�i�o�������͒i���Ȃ��BA3�AA4�AA5�K�i�o�������͒i������B,��,,,��,,,�L,,�w�̏o��������ԗ��̏�~��,�L,,�n��1�K���n�����R���R�[�X��1����,����,,,��,,,�L,����,�Œ�L�^�肷��1�����A�����グ���肷��1����,,��,���ނ�����ɂđΉ�,,�L,�ȈՌ^�i�֊�ɐ�򐅐���ݒu�j,,�L,,,��,,,��,,,�L,�L,�L,���a150cm�̎Ԉ֎q��]�X�y�[�X����,,��,,,��,,,��,,,�L,��,,A4�AA5�o�����ւ̒ʘH��1�@,�L,11�l���,�z�[���`�R���R�[�X��2�@�AA2b�n��o������1�@,�L,����A�G���x�[�^�[�����ɂ���,�v3�@,��,,,�L,��,�Ԉ֎q�g�p�҂��P�Ƃŏ�~�\,�v3�@,�L,�����K�A���~�����A�h�A�J�������ňē�,�v3�@,�L,�G���x�[�^�[��,�v3�@,�L,�����܂Ō�����,�v3�@,��,,,��,,,��,,,��,,,�L,,,�L,��ԉ^�s���\�����u,���D���t��,�L,,����,�L,,AED�P�[�X�ɓ\�t,�L,,�K�i�肷��A�_���^���\�A���������@�A�����ē��t�G�m�ē���,��,,,�L,,�w�̏o��������ԗ��̏�~���܂�,�L,�ʘH���̍L�����D�@�A�����̒Ⴂ���������@�i������������s�@�A�������Z�@�����܂ށj�A�Ԉ֎q�p�X���[�v��,�y�Ԉ֎q�p�X���[�v�z�����ɂđΉ�,�L,�w�W�����̃T�[�r�X��m���i�擾,,,35.70882692,139.7962946
�s�c�󑐐��󑐋��w,�����s�䓌��󑐋�1����18-11,03-3866-8765,��,�n������I�d,,,��,,,,��,,,,��,,A1�o�����ɃG���x�[�^�[����BA1�AA2�AA3�K�i�o�������͒i���Ȃ��BA4�AA5�AA6�K�i�o�������͒i������B,��,,,��,,,�L,,�w�̏o��������ԗ��̏�~��,�L,,�n��1�K���n�����R���R�[�X��1����,����,,,��,,,�L,����,�Œ�L�^�肷��1�����A�����グ���肷��2����,,��,���ނ�����ɂđΉ�,,�L,�I�X�g���C�g�p�����䂠��,,�L,,,��,,,��,,,�L,�L,�L,���a180cm�̎Ԉ֎q��]�X�y�[�X����,,�L,,,�L,,,�L,,,�L,��,,�z�[���`�R���R�[�X��1�@�AA3�n��o������4�@�i2�A�j,�L,11�l���,�z�[���`�R���R�[�X1�@�AA1�n��o����1�@,�L,����A�G���x�[�^�[�����ɂ���,�v2�@,��,,,�L,��,�Ԉ֎q�g�p�҂��P�Ƃŏ�~�\,�v2�@,�L,�����K�A���~�����A�h�A�J�������ňē�,�v2�@,�L,�G���x�[�^�[��,�v2�@,�L,�����܂Ō�����,�v2�@,��,,,��,,,��,,,��,,,�L,,����,�L,��ԉ^�s���\�����u,���D���t��,�L,,����,�L,,AED�P�[�X�ɓ\�t,�L,,�K�i�肷��A�_���^���\�A���������@�A�����ē��t�G�m�ē���,��,,,�L,,�w�̏o��������ԗ��̏�~���܂�,�L,�ʘH���̍L�����D�@�A�����̒Ⴂ���������@�i������������s�@�A�������Z�@�����܂ށj�A�Ԉ֎q�p�X���[�v��,�y�Ԉ֎q�p�X���[�v�z�����ɂđΉ�,�L,�w�W�����̃T�[�r�X��m���i�擾,,,35.69757166,139.7864464
�s�c�󑐐����O�w,�����s�䓌�摠�O2����3-1,03-3866-8770,��,�n������I�d,,,��,,,,��,,,,��,,A0�AA1b�o�����̓G���x�[�^�[����BA3�AA4�K�i�o�������͒i���Ȃ��BA0�AA1�AA2�K�i�o�������͒i������B,��,,,��,,,�L,,�w�̏o��������ԗ��̏�~��,�L,,�n��1�K���n�����R���R�[�X��1����,����,,,��,,,�L,����,�Œ�L�^�肷��1�����A�����グ���肷��3����,,��,���ނ�����ɂđΉ�,,�L,�I�X�g���C�g�p�����䂠��,,�L,,,�L,,,��,,,�L,�L,�L,���a150cm�̎Ԉ֎q��]�X�y�[�X����,,�L,,,��,,,��,,,�L,��,,A2�o����,�L,������^1�@�A�ђʌ^1�@�i�e11�l���j,A0�o������1�@�AA1b������1�@,�L,����A�G���x�[�^�[�����ɂ���,�v2�@,��,,,�L,��,�Ԉ֎q�g�p�҂��P�Ƃŏ�~�\,�v2�@,�L,�����K�A���~�����A�h�A�J�������ňē�,�v2�@,�L,�G���x�[�^�[��,�v2�@,�L,�y������^�z�����܂Ō�����y�ђʌ^�z���㕔��2�����ݒu,,��,,,��,,,��,,,��,,,�L,,����,�L,��ԉ^�s���\�����u,���D���t��,�L,,����,�L,,AED�P�[�X�ɓ\�t,�L,,�K�i�肷��A�_���^���\�A���������@�A�����ē��t�G�m�ē���,��,,,�L,,�w�̏o��������ԗ��̏�~���܂�,�L,�ʘH���̍L�����D�@�A�����̒Ⴂ���������@�i������������s�@�A�������Z�@�����܂ށj�A�Ԉ֎q�p�X���[�v��,�y�Ԉ֎q�p�X���[�v�z�����ɂđΉ�,�L,�w�W�����̃T�[�r�X��m���i�擾,,,35.7031685,139.7908767
�s�c��]�ː����O�w,�����s�䓌���3����3-1,03-3843-8941,��,�n������I�d,,,��,,,,��,,,,��,,A5�o�����ɃG���x�[�^�[����BA5�AA6�AA7�K�i�o�������͒i���Ȃ��B,��,,,��,,,�L,,�w�̏o��������ԗ��̏�~��,�L,,�n��1�K�����t�߃R���R�[�X,����,,,��,,,�L,����,�Œ�L�^�肷��1�����A�����グ���肷��3����,,��,���ނ�����ɂđΉ�,,�L,�ȈՌ^�i�֊�ɐ�򐅐���ݒu�j,,�L,,,��,,,��,,,�L,�L,�L,���a150cm�̎Ԉ֎q��]�X�y�[�X����,,�L,�I�X�g���C�g�p�ȈՐ�����̌^,,��,,,��,,,�L,�L,,A5�o������1�@�AA6�o������2�@�AA7�o�������ʒʘH��2�@�A�z�[���`�R���R�[�X��3�@,�L,11�l���,A5�o������1�@�A�z�[���`�R���R�[�X��1�@,�L,����A�G���x�[�^�[�����ɂ���,�v2�@,��,,,�L,��,�Ԉ֎q�g�p�҂��P�Ƃŏ�~�\,�v2�@,�L,�����K�A���~�����A�h�A�J�������ňē�,�v2�@,�L,�G���x�[�^�[��,�v2�@,�L,�y������^�z�����܂Ō�����y�ђʌ^�z���㕔��2�����ݒu,,��,,,��,,,��,,,��,,,�L,,����,�L,��ԉ^�s���\�����u,���D���t��,�L,,����,�L,,AED�P�[�X�ɓ\�t,�L,,�K�i�肷��A�_���^���\�A���������@�A�����ē��t�G�m�ē���,��,,,�L,,�w�̏o��������ԗ��̏�~���܂�,�L,�z�[���Ǝԗ��̒i���΍�����{�A�ʘH���̍L�����D�@�A�����̒Ⴂ���������@�i������������s�@�A�������Z�@�����܂ށj�A�Ԉ֎q�p�X���[�v��,�y�i���΍�z4����3�Ԕ���5����1�Ԕ��y�Ԉ֎q�p�X���[�v�z�����ɂđΉ�,�L,�w�W�����̃T�[�r�X��m���i�擾,,,35.70562558,139.7921654
�s�c��]�ː��V��k���w,�����s�䓌�挳��1����5-2,03-3836-2218,��,�n������I�d,,,��,,,,��,,,,��,,A3�AA4�o�����ɃG���x�[�^�[����BA1�AA3�AA4�K�i�o�������͒i���Ȃ��BA2�K�i�o�������͒i������B,��,,,��,,,�L,,�w�̏o��������ԗ��̏�~��,�L,,�n��1�K�����t�߃R���R�[�X,����,,,��,,,�L,����,�Œ�L�^�肷��1�����A�����グ���肷��4����,,��,���ނ�����ɂđΉ�,,�L,�ȈՌ^�i�֊�ɐ�򐅐���ݒu�j,,�L,,,��,,,��,,,�L,�L,�L,���a150cm�̎Ԉ֎q��]�X�y�[�X����,,�L,�I�X�g���C�g�p�ȈՐ�����̌^,,��,,,��,,,�L,�L,,A1�o������2�@�AA3�o������2�@�A�z�[���`�R���R�[�X��2�@�A�z�[���`����EXP���D����2�@,�L,������^2�@�A���p������^1�@�i�e11�l���j,A3�o������1�@�A�z�[���`�R���R�[�X��1�@�A�z�[���`����EXP���D����1�@,�L,����A�G���x�[�^�[�����ɂ���,�v3�@,��,,,�L,��,�Ԉ֎q�g�p�҂��P�Ƃŏ�~�\,,�L,�����K�A���~�����A�h�A�J�������ňē�,�v3�@,�L,�G���x�[�^�[��,�v3�@,�L,�y������^�z�����܂Ō�����y���p������^�z���㕔��2�����ݒu,�y������^�z2�@�y���p������^�z1�@,��,,,��,,,��,,,��,,,�L,,����,�L,��ԉ^�s���\�����u,���D���t��,�L,,����,�L,,AED�P�[�X�ɓ\�t,�L,,�K�i�肷��A�_���^���\�A���������@�A�����ē��t�G�m�ē���,��,,,�L,,�w�̏o��������ԗ��̏�~���܂�,�L,�z�[���Ǝԗ��̒i���΍�����{�A�ʘH���̍L�����D�@�A�����̒Ⴂ���������@�i������������s�@�A�������Z�@�����܂ށj�A�Ԉ֎q�p�X���[�v��,�y�i���΍�z4����3�Ԕ���5����2�Ԕ��y�Ԉ֎q�p�X���[�v�z�����ɂđΉ�,�L,�w�W�����̃T�[�r�X��m���i�擾,,,35.70703527,139.7819435
�����󑐉w,�����s�䓌��Ԑ��1����4-1,03-3841-0603,��,,,,��,,,,��,,,,��,�z�[���K�܂ŃG���x�[�^�[����,���ʌ��̂ݒi���Ȃ�,�L,,���ʌ��̂�,�L,���D���ɃE�H�[�N�C���J�E���^�[������A�����h�A�ݒu,���ʌ��̂�,�L,���s��Ή��ς�,,�L,,���D�O���ʌ���,����,,,�L,,,�L,����,,,��,���j�o�[�T���V�[�g�ɂđΉ�,,�L,,��ʃg�C���ɂ��ꕔ���ɐݒu,��,���j�o�[�T���V�[�g�ɂđΉ�,,�L,,��ʃg�C���ɂ��ꕔ���ɐݒu,�L,���@���c���x�b�h�A���ނ�����,,�L,�L,�L,,,�L,�I�X�g���C�g�p�ȈՐ�����̌^,,�L,���ʌ��̃G���x�[�^�[�o�����܂ŃX���[�v�ɂ��i�������A�z�[���K�܂ł̓G���x�[�^�[�őΉ��B,���ʌ�,��,,,�L,�L,,,�L,,���ʌ��̂�,�L,�G�m�ē�����,,��,,,�L,��,,,�L,�����K�A���~�����A�h�A�J�������ňē�,,�L,,,�L,,,��,���c����p�x�b�h�̐ݒu�͖���,,��,,,��,,,��,,,�L,,����,�L,���Ԉē����u�ł̏��ē��A�ʓr�T�C�l�[�W�ɂ��ُ펞�̂��m�点��\���B,���D���ق�,��,,,��,,,�L,�_���^���\�͑S�w���̕\������,�G�m�ē��A�w�\���}�A�^���\�A�肷��,�L,�d���Ԃ������ԕ��̍L���Ԃ����������p�̂��q�l�����}��Ԃɂ���ԂɂȂ�ۂɁA��Ԉʒu�̊֌W�Ŏԓ����ړ�����K�v������ꍇ�ɂ̂ݗ��p�B�i���}��ԓ��Ɍ���B�j,,�L,,�w���������Ԍ��܂�,��,,,�L,�w�\���ł��g�̂̕s���R�Ȃ��q�l�₲�ē����K�v�Ǝv���邨�q�l�����������ۂ́A�Ј�����ϋɓI�ɂ��������������Ă��������R�~���j�P�[�V������}���Ă���B�������A�ē�����]����Ȃ��ꍇ�́A�\�Ȕ͈͂ł��q�l�𒍎����Ă���E�T�[�r�X��m�̎��i���擾,,���������ē��̓o���A�t���[�g�C���ȊO�ɉw�\���̐G�m�ē��A���D�A�K�i�ɂ��ݒu,35.71203393,139.7983759
�������w,�����s�䓌�������1-60,03-3831-2528,��,�n������I�d,,,��,,,,��,,,,��,�G���x�[�^�[����,�o����,��,,,��,,,�L,,�o���A�t���[���[�g��,�L,,���D�O�R���R�[�X��1�����A���D���R���R�[�X��1����,����,,,�L,,,�L,����,,,��,,,�L,,,�L,,,�L,,,��,,,�L,�L,�L,,,�L,,,��,,,��,,,�L,�L,,,�L,,���D�O�R���R�[�X��1�����A1�E2�Ԑ��z�[����1�����A3�E4�Ԑ��z�[����1����,�L,,,��,,,�L,��,,,�L,,,�L,,,��,,,��,,,��,,,��,,,��,,,�L,,����,�L,�s��ē��\����E�^�s���f�B�X�v���C�ŏ���,���D���ق�,�L,,�w����,�L,,,�L,,,��,,,�L,,�o���A�t���[���[�g��,��,,,�L,,,,35.71131607,139.7735114
��쉶������2���g�C��,�����s�䓌�������5,,��,6:00����20:00,,,,,,,,,,,,,,,,,,,,��,,,�L,,,�蓮,,,�L,,,�L,,,,��,,,�L,�����Ή�,,�L,,,�L,,,��,,,�L,�L,,,,�L,,,,,,,,,,,,,,,,,,,,,,,,,,,,,,,,,,,,,,,,,,,,,,,,,,,,,,,,,,,,,,,,,,,,,,,,,,���p�Ăяo���{�^������,35.714929,139.774883
�J���쉀�Ǘ����O�g�C��,�����s�䓌��J��7����5-24,,,8:30����17:00,,,��,,,,��,,,,��,���H�ƃg�C���̋��ɂ킸���Ȓi������,,��,,,��,,,��,,,�L,�������o���A�t���[�g�C��,,�蓮,,,��,,,�L,����,,,�L,,,��,,,�L,,,��,,,��,,,�L,�L,�L,,,�L,,,��,,,��,,,��,,,,��,,,,,,,,,,,,,,,,,,,,,,��,,,�L,,�Ǘ���,,,,,,,�L,,�Ǘ���,��,,,�L,,�Ǘ���,��,,,��,,,�L,,�Ǘ����ɂđݏo�i1��j,��,,,��,,,�L,�����E�������q�l�̂��v�]�ɉ����đΉ��������܂��B,����,,35.72409305,139.7704497
���k����,�����s�䓌��󑐋�5����1-35,03-5246-1321,��,�I��,03-5246-1319,,��,,,,��,,,,��,�����̏o�����͒i�������B�����̏o�����̓X���[�v�ƊK�i���ݒu����Ă��邪�A���H�Ƃ̋��E�������i���ɂȂ��Ă���B,�����o����,�L,�肷��Ȃ�,�����o����,��,,,�L,,�����o����,�L,,�����o�����t��,�蓮,,,��,,,�L,����,,,��,,,��,,,��,,,��,,,��,,,�L,�L,�L,,,��,,,��,,,��,,,��,,,,��,,,,,,,,,,,,,,,,,,,,,,��,,,��,,,��,,,��,,,��,,,��,,,��,,,��,,,��,,,��,,,��,,,�L,����ҁA��Q�ғ������p���₷�������ݏ��ݒu,�����o�����t�߂�1��,�L,HP�≀���ւ̌f���ɂ��A�����̗��p���[���̏��񋟂����{���Ă���B,������Ή��̐��D��2��A��HP,,35.69976196,139.7825475
��������,�����s�䓌��Oɗ�1����23,03-5246-1321,��,�I��,03-5246-1319,,��,,,,��,,,,��,,�S�Ă̏o����,�L,�肷�肠��,�k���o����,��,,,�L,,�S�Ă̏o�����A�k�����o��������o���A�t���[�g�C���܂�,�L,,��������,�蓮,,,��,,,�L,����,,,��,,,�L,�ȈՌ^�i�֊�ɐ�򐅐���ݒu�j,,�L,,,�L,,,��,,,�L,�L,��,,,�L,,,��,,,��,,,��,,,,��,,,,,,,,,,,,,,,,,,,,,,��,,,��,,,��,,,��,,,��,,,��,,,��,,,��,,,��,,,��,,,��,,,��,����ҁA��Q�ғ������p���₷�������ݏ��ݒu,�V��L�����1��,�L,HP�≀���ւ̌f���ɂ��A�����̗��p���[���̏��񋟂����{���Ă���B,������Ή��̐��D��2��A��HP,,35.72845721,139.7928168